{"text_format":"1","workbook":"xlsx","n_sheets":19,"sheets":["Оглавление","Инструкция","Бренд","Информация","Артикул ZN","Артикул ZV","Варианты Решёток","ZN - естественная конвекция","ZV - принудительная конвекция","Подбор ZN","Цены ZN","Подбор ZV и ZV Turbo","Цены ZV и ZV TURBO","Заказ","Версии","Доп. комплектация","Ограничения","Справочник ZN","Справочник ZV"],"not_rendered":{"charts":0,"images":14,"macros":1,"external_links":0,"defined_names":28,"comments":0,"pivot_tables":0},"unopened":[],"bounds":{"document_bytes":16777216,"sheet_cells":100000,"rows_first":2000,"rows_last":500,"rows_between":2000,"halvings":0,"cell_chars":16384,"cell_head_chars":4096},"cells_cut":0,"cells_raw":0,"read":"whole","date_system":"1900"}

{"sheet":"Оглавление","index":0,"n_rows":22,"n_cols":5,"rows_kept":22,"cut":false,"hidden":false,"merged":[[0,4,0,5],[5,4,5,5],[2,4,2,5],[4,4,4,5],[1,4,1,5],[3,4,3,5],[13,1,13,5],[8,1,8,5],[9,1,9,5],[10,1,10,5],[11,1,11,5],[12,1,12,5],[20,1,20,5],[21,1,21,5],[14,2,14,5],[15,2,15,5],[16,1,16,5],[17,2,17,5],[18,2,18,5],[19,1,19,5]]}
[]
[null,null,null,"Прайс-лист на продукцию","www.zolter.ru"]
[null,null,null,"05.02.2025 ver. 1-5-1"]
[null,null,null,null,"+7-495-150-77-06"]
[]
[null,null,null,"Оглавление","info@zolter.ru"]
{"$rows_left_out":17}
{"sheet":"Инструкция","index":1,"n_rows":34,"n_cols":1,"rows_kept":34,"cut":false,"hidden":false,"merged":[]}
["К оглавлению"]
[]
["Краткая инструкция по работе с файлом"]
[]
["1. После открытия файла для возможности формирования заказа согласитесь на включение макросов и содержимого"]
[]
{"$rows_left_out":29}
{"sheet":"Бренд","index":2,"n_rows":1,"n_cols":2,"rows_kept":1,"cut":false,"hidden":false,"merged":[]}
[null,"К оглавлению"]

{"sheet":"Информация","index":3,"n_rows":1,"n_cols":2,"rows_kept":1,"cut":false,"hidden":false,"merged":[]}
[null,"К оглавлению"]

{"sheet":"Артикул ZN","index":4,"n_rows":45,"n_cols":29,"rows_kept":45,"cut":false,"hidden":false,"merged":[]}
[null,"К оглавлению"]
[null,null,null,null,null,null,null,null,null,null,null,null,null,null,null,null,null,null,null,null,null,null,null,null,null,null,null,null,"Сформированный артикул"]
[null,"Формирование артикула ZOLTER ZN",null,null,null,null,null,null,null,null,null,null,null,null,null,null,null,null,null,null,null,null,null,null,null,null,null,null,{"$f":"_xlfn.CONCAT(I4:AA4)","v":"ZN-H250.110.2500.K.RR1500\\RR10.1.U"}]
[null,null,null,null,null,null,null,null,"ZN-H",250,".",110,".",2500,".","K",".","R","R",1500,"\\","RR",10,".",1,".","U"]
[]
[]
{"$rows_left_out":40}
{"sheet":"Артикул ZV","index":5,"n_rows":50,"n_cols":33,"rows_kept":50,"cut":false,"hidden":false,"merged":[]}
[null,"К оглавлению"]
[null,null,null,null,null,null,null,null,null,null,null,null,null,null,null,null,null,null,null,null,null,null,null,null,null,null,null,null,null,null,null,null,"Сформированный артикул"]
[null,"Формирование артикула ZOLTER",null,null,null,null,null,null,null,null,null,null,null,null,null,null,null,null,null,null,null,null,null,null,null,null,null,null,null,null,null,null,{"$f":"_xlfn.CONCAT(I4:AE4)","v":"ZV200.80.2500.K.LR1500\\24V.FCM\\RR10.1.U"}]
[null,null,null,null,null,null,null,null,"ZV",200,".",80,".",2500,".","K",".","L","R",1500,"\\","24V",".","FCM","\\","RR",10,".",1,".","U"]
[]
[]
{"$rows_left_out":45}
{"sheet":"Варианты Решёток","index":6,"n_rows":31,"n_cols":14,"rows_kept":31,"cut":false,"hidden":false,"merged":[[4,7,4,11]]}
[null,"К оглавлению"]
[]
[null,"Варианты решеток ZOLTER"]
[]
[null,null,null,null,null,"Планки решеток",null,"Цена за метр погонный при ширине"]
[null,null,null,null,null,"Код решетки","Описание решетки","140","200","250","300","380",null,"Втулки"]
{"$rows_left_out":26}
{"sheet":"ZN - естественная конвекция","index":7,"n_rows":35,"n_cols":13,"rows_kept":35,"cut":false,"hidden":false,"merged":[[4,1,4,12]]}
[null,"К оглавлению"]
[]
[null,"Конвекторы с естественной конвекцией (ZN)"]
[]
[null,"Встраиваемый в пол конвектор с естественной конвекцией Zolter ZN — это отопительный прибор, который обладает не только неповторимым дизайном, но и улучшенными функциональными характеристиками, которые адаптированы для российских условий эксплутатации. Данная модель прекрасно подойдет для установки в помещения с витражным остеклением в качестве основного или вспомогательного прибора отопления. Zolter ZN может быть установлен в многоквартирном и частном доме. Обеспечена универсальность выбора подключения: правое либо левое, с торца или с фасада. Выбирается монтажником на месте без изменения конструкции конвектора. Конвекторы могут быть выполнены в прямом, угловом или радиусном исполнении."]
[]
{"$rows_left_out":30}
{"sheet":"ZV - принудительная конвекция","index":8,"n_rows":36,"n_cols":13,"rows_kept":36,"cut":false,"hidden":false,"merged":[[4,1,4,12]]}
[null,"К оглавлению"]
[]
[null,"Конвекторы с принудительной конвекцией (ZV)"]
[]
[null,"Встраиваемый в пол конвектор с принудительной конвекцией Zolter ZV – это стильный отопительный прибор повышенной эффективности благодаря встроенным тангенциальным вентиляторам. Рекомендован для установки в помещениях с высокими потолками и витражным остеклением, где требуется быстрый прогрев большой площади, в качестве основного прибора отопления. Интеллектуальная система управления конвектора, энергоэффективные вентиляторы, надежная и невероятно стильная конструкция позволяют считать конвектор серии Zolter ZV идеальным решением для отопления дома или квартиры.  \nА серия Zolter ZV Turbo – это улучшенная модификация внутрипольного конвектора с увеличенной тепловой мощностью.\nКонвекторы с постфиксом H - предназначены для влажных помещений и снабжены дренажем"]
[]
{"$rows_left_out":31}
{"sheet":"Подбор ZN","index":9,"n_rows":1039,"n_cols":13,"rows_kept":1039,"cut":false,"hidden":false,"merged":[]}
[null,"К оглавлению",null,null,null,null,null,null,null,null,"Теплоотдача ниже требуемой"]
[null,null,null,null,null,null,null,null,null,null,"Теплоотдача близка к требуемой"]
[null,null,null,null,null,null,null,null,null,null,"Теплоотдача выше требуемой"]
[null,null,"Ширина","Высота","Требуемая мощность 95°/85°/20°С","Допустимые отклонения по мощности -/+ в %"]
[null,null,null,null,2000,0.05," - выберите и введите значения дла подбора или оставьте пустым, если они не значимы"]
[]
{"$rows_left_out":1034}
{"sheet":"Цены ZN","index":10,"n_rows":1042,"n_cols":13,"rows_kept":1042,"cut":false,"hidden":false,"merged":[]}
[null,"К оглавлению"]
[]
[]
[]
[]
[]
{"$rows_left_out":1037}
{"sheet":"Подбор ZV и ZV Turbo","index":11,"n_rows":895,"n_cols":19,"rows_kept":895,"cut":false,"hidden":false,"merged":[]}
[null,"К оглавлению",null,null,null,null,null,null,null,null,null,null,null,null,null,"Теплоотдача ниже требуемой"]
[null,null,null,null,null,null,null,null,null,null,null,null,null,null,null,"Теплоотдача близка к требуемой"]
[null,null,null,null,null,null,null,null,null,null,null,null,null,null,null,"Теплоотдача выше требуемой"]
[null,null,"Ширина","Высота","Требуемая мощность 95°/85°/20°С","Допустимые отклонения по мощности -/+ в %"]
[null,null,200,null,1000,0.1," - выберите и введите значения дла подбора или оставьте пустым, если они не значимы"]
[]
{"$rows_left_out":890}
{"sheet":"Цены ZV и ZV TURBO","index":12,"n_rows":897,"n_cols":19,"rows_kept":897,"cut":false,"hidden":false,"merged":[]}
[null,"К оглавлению"]
[]
[]
[]
[]
[]
{"$rows_left_out":892}
{"sheet":"Заказ","index":13,"n_rows":120,"n_cols":25,"rows_kept":120,"cut":false,"hidden":false,"merged":[]}
[null,null,null,null,null,null,null,null,null,null,null,"К оглавлению","Не забудьте добавить термостат с закладки Доп. комплектация для вентиляторных приборов!!!"]
[null,null,null,null,null,null,null,null,null,null,null,null,"Заявка"]
[]
[null,null,null,null,null,null,null,null,null,null,null,null,null,null,null,null,"ИТОГО",null,{"$f":"SUM(S6:S262)","v":0},{"$f":"SUM(T6:T262)","v":0},null,0]
["Модель","Размерность","Длина прибора","Ширина","Высота","Габаритная высота","Теплоотдача 95°/85°/20°С","Цена с анодированной бесцветной алюминиевой решеткой","Цена без решётки и окантовки","Цена с анодированной цветной алюминиевой решеткой","Цена с деревянной решёткой","Описание","Количество","Решетка, пустое значение - без решетки","Исполнение (концевое/ проходное)","Профиль окантовки (U-образный или F-образный)","Скидка, %","Цена без скидки","Сумма без скидки","Сумма скидки","Цена со скидкой","Сумма с учетом скидки","Решетка/смещение","Артикул","Код"]
[null,null,null,null,null,null,null,null,null,null,null,{"$f":"IF(A6<>\"\",IF(LEFT(A6,9)=\"Конвектор\",CONCATENATE(\"Конвектор \",A6,\", Ширина: \",D6,\", Высота:\",E6,\" Длина:\",C6,IF(N6=\"\",\",  Без решетки\",CONCATENATE(\" C решеткой: \",N6)),\", Макс. Теплоотдача: \",G6, \" Вт\",\", Исполнение: \",O6,\", Профиль окантовки: \",P6,\"-образный \"),A6),\"\")","v":""},null,null,null,null,null,{"$f":"IFERROR(S6/M6,\"\")","v":""},{"$f":"IF(M6>0,IF(LEFT(A6,9)=\"Конвектор\",INDIRECT(\"RC[\"&W6&\"]\",FALSE)*Заказ!M6,H6*Заказ!M6),\"\")","v":""},{"$f":"IFERROR(S6*Q6/100,\"\")","v":""},{"$f":"IFERROR(V6/M6,\"\")","v":""},{"$f":"IFERROR(S6-T6,S6)","v":""},{"$f":"IF(M6<>\"\",IFERROR(VLOOKUP(N6,'Варианты Решёток'!$G$7:$M$13,7,FALSE),-9),\"\")","v":""},{"$f":"IF(A6<>\"\",IF(LEFT(A6,9)=\"Конвектор\",CONCATENATE(RIGHT(A6,LEN(A6)-10),D6,\".\",E6,\".\",C6,\".\",IF(O6=\"концевое\",\"K\",IF(O6=\"проходное\",\"P\",\"\")),\"\\\",IF(A6=\"ZN\",\"\",\"24V.FCM\\\"),IF(N6=\"\",\"OR\",CONCATENATE(\"RR\",INDEX('Варианты Решёток'!$F$7:$F$13,MATCH(Заказ!N6,Таблица1[Описание решетки],0)),\".\",VLOOKUP(N6,'Варианты Решёток'!$G$7:$O$13,8,FALSE)))),INDEX('Доп. комплектация'!D:D,MATCH(A6,'Доп. комплектация'!B:B,0))),\"\")","v":""},{"$f":"IF(A6<>\"\",IF(LEFT(A6,9)=\"Конвектор\",CONCATENATE(RIGHT(A6,LEN(A6)-10),D6,E6,C6,IF(O6=\"концевое\",\"K\",IF(O6=\"проходное\",\"P\",\"\")),IF(A6=\"ZN\",\"\",\"24V.FCM\\\"),IF(N6=\"\",\"OR\",CONCATENATE(\"RR\",INDEX('Варианты Решёток'!$F$7:$F$13,MATCH(Заказ!N6,Таблица1[Описание решетки],0)),VLOOKUP(N6,'Варианты Решёток'!$G$7:$O$13,8,FALSE)))),INDEX('Доп. комплектация'!D:D,MATCH(A6,'Доп. комплектация'!B:B,0))),\"\")","v":""}]
{"$rows_left_out":115}
{"sheet":"Версии","index":14,"n_rows":10,"n_cols":3,"rows_kept":10,"cut":false,"hidden":false,"merged":[]}
[null,"Версионность"]
[]
["Версия","Изменение","Дата"]
["1-2","Первая публичная версия","2023-09-27"]
["1-3","В описание Заказа добавлена длина","2023-09-28"]
["1-3","Добавлено формирование артикула","2023-09-28"]
{"$rows_left_out":5}
{"sheet":"Доп. комплектация","index":15,"n_rows":21,"n_cols":5,"rows_kept":21,"cut":false,"hidden":false,"merged":[]}
["К оглавлению"]
[]
[]
[null,"Дополнительные комплектующие"]
[]
[]
{"$rows_left_out":16}
{"sheet":"Ограничения","index":16,"n_rows":25,"n_cols":5,"rows_kept":25,"cut":false,"hidden":true,"merged":[]}
["Концевое исполнение"]
["140x80",1,null,1,2]
["140x90",1,null,"проходное","концевое"]
["140x110",1,null,null,"проходное"]
["140x150",2]
["200x80",2]
{"$rows_left_out":20}
{"sheet":"Справочник ZN","index":17,"n_rows":46,"n_cols":56,"rows_kept":46,"cut":false,"hidden":true,"merged":[]}
["Наименование модели:",null,null,null,null,null,null,"Габаритные размеры:",null,null,null,null,"Исполнение подключения:",null,null,null,"Подключение (только для радиусных и угловых):",null,null,null,"Конструктивное исполнение:",null,null,null,null,null,"Рабочее напряжение для вентиляторных конвекторов:",null,null,null,null,null,"Тип встроенного регулятора оборотов вентилятора:",null,null,null,null,null,null,null,"Тип (исполнение) решетки:",null,null,null,"Планки решетки:",null,null,null,null,null,null,"Цвет втулок решетки:",null,null,"Профиль окантовки:"]
["ZN","естественная конвекция для сухих помещений",null,null,null,null,null,null,null,null,null,null,"K","концевое",null,null,null,"Любое (кроме радиусных и угловых)",null,null,null,null,null,null,null,null,"24V","- 24V – напряжение 24 В постоянного тока (DC).",null,null,null,null,null,"- Без обозначения – Без блока регулировки",null,null,null,null,null,null,"RR","- RR - рулонная решетка",null,null,10,"- 10 – анодированный алюминий, цвет «натуральный»",null,null,null,null,null,1,"- 1 – алюминий (под цвет планок)",null,"U","- U – U-образный профиль (стандартное исполнение)"]
["ZN-H","естественная конвекция для влажных помещений",null,null,null,null,null,null,null,null,null,null,"Р","проходное",null,null,"R","- R - правое",null,null,"R",null,null,null,null,null,null,null,null,null,null,null,"FCM","   регулировки вентиляторов (только для вентиляторов 220V).",null,null,null,null,null,null,"OR","- OR - Без решетки",null,null,11,"- 11 – анодированный алюминий, цвет «шампань»",null,null,null,null,null,2,"- 2 – бежевый",null,"F","- F – F-образный профиль."]
[null,null,null,null,null,null,null,"Ширина","Высота","Длина",null,null,null,null,null,null,"L","- L - левое",null,null,"A",null,null,null,null,null,null,null,null,null,null,null,null,"- FCM– встроен модуль для автоматической плавной",null,null,null,null,null,null,null,null,null,null,12,"- 12 – анодированный алюминий, цвет «латунь»",null,null,null,null,null,3,"- 3 – черный"]
[null,null,null,null,null,null,null,140,80,800,null,null,null,null,null,null,null,null,null,null,null,null,null,null,null,null,null,null,null,null,null,null,null,"  регулировки ЕС-вентиляторов 24V DC",null,null,null,null,null,null,null,null,null,null,13,"- 13 – анодированный алюминий, цвет «темная бронза»"]
[null,null,null,null,null,null,null,200,90,900,null,null,null,null,null,null,null,null,null,null,null,null,null,null,null,null,null,null,null,null,null,null,null,null,null,null,null,null,null,null,null,null,null,null,14,"- 14 – анодированный алюминий, цвет «светлое золото»"]
{"$rows_left_out":41}
{"sheet":"Справочник ZV","index":18,"n_rows":46,"n_cols":56,"rows_kept":46,"cut":false,"hidden":true,"merged":[]}
["Наименование модели:",null,null,null,null,null,null,"Габаритные размеры:",null,null,null,null,"Исполнение подключения:",null,null,null,"Подключение:",null,null,null,"Конструктивное исполнение:",null,null,null,null,null,"Рабочее напряжение для вентиляторных конвекторов:",null,null,null,null,null,"Тип встроенного регулятора оборотов вентилятора:",null,null,null,null,null,null,null,"Тип (исполнение) решетки:",null,null,null,"Планки решетки:",null,null,null,null,null,null,"Цвет втулок решетки:",null,null,"Профиль окантовки:"]
["ZV","конвектор для сухих помещений",null,null,null,null,null,null,null,null,null,null,"K","концевое",null,null,"R","- R - правое",null,null,null,null,null,null,null,null,"24V","- 24V – напряжение 24 В постоянного тока (DC).",null,null,null,null,null,"- Без обозначения – Без блока регулировки",null,null,null,null,null,null,"RR","- RR - рулонная решетка",null,null,10,"- 10 – анодированный алюминий, цвет «натуральный»",null,null,null,null,null,1,"- 1 – алюминий (под цвет планок)",null,"U","- U – U-образный профиль (стандартное исполнение)"]
["ZV TURBO","конвектор для сухих помещений",null,null,null,null,null,null,null,null,null,null,"Р","проходное",null,null,"L","- L - левое",null,null,"R",null,null,null,null,null,null,null,null,null,null,null,"FCM","   регулировки вентиляторов (только для вентиляторов 220V).",null,null,null,null,null,null,"OR","- OR - Без решетки",null,null,11,"- 11 – анодированный алюминий, цвет «шампань»",null,null,null,null,null,2,"- 2 – бежевый",null,"F","- F – F-образный профиль."]
["ZV-H","конвектор для влажных помещений",null,null,null,null,null,"Ширина","Высота","Длина",null,null,null,null,null,null,null,null,null,null,"A",null,null,null,null,null,null,null,null,null,null,null,null,"- FCM– встроен модуль для автоматической плавной",null,null,null,null,null,null,null,null,null,null,12,"- 12 – анодированный алюминий, цвет «латунь»",null,null,null,null,null,3,"- 3 – черный"]
["ZV-H TURBO","конвектор для влажных помещений",null,null,null,null,null,200,80,800,null,null,null,null,null,null,null,null,null,null,null,null,null,null,null,null,null,null,null,null,null,null,null,"  регулировки ЕС-вентиляторов 24V DC",null,null,null,null,null,null,null,null,null,null,13,"- 13 – анодированный алюминий, цвет «темная бронза»"]
[null,null,null,null,null,null,null,250,110,900,null,null,null,null,null,null,null,null,null,null,null,null,null,null,null,null,null,null,null,null,null,null,null,null,null,null,null,null,null,null,null,null,null,null,14,"- 14 – анодированный алюминий, цвет «светлое золото»"]
{"$rows_left_out":40}